BDBM50135056 2,6-Diamino-1-thiazolidin-3-yl-hexan-1-one::CHEMBL148955
SMILES NCCCCC(N)C(=O)N1CCSC1
InChI Key InChIKey=OIOCYLDAIBUSNI-UHFFFAOYSA-N
Data  5 IC50
  Tab Delimited (TSV)   2D SDfile   Computed 3D by Vconf -m prep SDfile
Find this compound or compounds like it in BindingDB:
Activity Spreadsheet -- Enzyme Inhibition Constant Data from BindingDB
Found 5 hits for monomerid = 50135056
TargetDipeptidyl peptidase 2(Homo sapiens (Human))
University Of Antwerp (Uia)
Curated by ChEMBL
LigandPNGBDBM50135056(2,6-Diamino-1-thiazolidin-3-yl-hexan-1-one | CHEMB...)
Affinity DataIC50:  3.00E+3nM. Assay description: Inhibitory activity of compound against Dipeptidylpeptidase II (DPP II)
In DepthDetails ArticlePubMed
TargetDipeptidyl peptidase 4(Homo sapiens (Human))
University Of Antwerp (Uia)
Curated by ChEMBL
LigandPNGBDBM50135056(2,6-Diamino-1-thiazolidin-3-yl-hexan-1-one | CHEMB...)
Affinity DataIC50:  3.18E+5nM. Assay description: Inhibitory activity against Dipeptidylpeptidase IV (DPP IV)
In DepthDetails ArticlePubMed
TargetDipeptidyl peptidase IV(Porphyromonas gingivalis)
University Of Warwick
Curated by ChEMBL
LigandPNGBDBM50135056(2,6-Diamino-1-thiazolidin-3-yl-hexan-1-one | CHEMB...)
Affinity DataIC50:  1.90E+4nM. Assay description: Inhibition of Porphyromonas gingivalis N-terminal His-tagged DPP4 expressed in Escherichia coli using Gly-Pro-p-nitroanilide as substrate
In DepthDetails ArticlePubMed
TargetDipeptidyl peptidase 2(Homo sapiens (Human))
University Of Antwerp (Uia)
Curated by ChEMBL
LigandPNGBDBM50135056(2,6-Diamino-1-thiazolidin-3-yl-hexan-1-one | CHEMB...)
Affinity DataIC50:  3.00E+3nM. Assay description: Inhibitory activity of compound against Dipeptidylpeptidase II (DPP II)
In DepthDetails ArticlePubMed
TargetDipeptidyl peptidase 4(Homo sapiens (Human))
University Of Antwerp (Uia)
Curated by ChEMBL
LigandPNGBDBM50135056(2,6-Diamino-1-thiazolidin-3-yl-hexan-1-one | CHEMB...)
Affinity DataIC50:  3.18E+5nM. Assay description: Inhibitory activity against Dipeptidylpeptidase IV (DPP IV)
In DepthDetails ArticlePubMed