BDBM50135060 2-Amino-1-piperidin-1-yl-pentan-1-one::CHEMBL146190
SMILES CCCC(N)C(=O)N1CCCCC1
InChI Key InChIKey=ZMEMJRDPYLWFGD-UHFFFAOYSA-N
Data  2 IC50
  Tab Delimited (TSV)   2D SDfile   Computed 3D by Vconf -m prep SDfile
Find this compound or compounds like it in BindingDB:
Activity Spreadsheet -- Enzyme Inhibition Constant Data from BindingDB
Found 2 hits for monomerid = 50135060
TargetDipeptidyl peptidase 2(Homo sapiens (Human))
University Of Antwerp (Uia)
Curated by ChEMBL
LigandPNGBDBM50135060(2-Amino-1-piperidin-1-yl-pentan-1-one | CHEMBL1461...)
Affinity DataIC50:  5.71E+4nM. Assay description: Inhibitory activity of compound against Dipeptidylpeptidase II (DPP II)
In DepthDetails ArticlePubMed
TargetDipeptidyl peptidase 4(Homo sapiens (Human))
University Of Antwerp (Uia)
Curated by ChEMBL
LigandPNGBDBM50135060(2-Amino-1-piperidin-1-yl-pentan-1-one | CHEMBL1461...)
Affinity DataIC50:  2.29E+5nM. Assay description: Inhibitory activity against Dipeptidylpeptidase IV (DPP IV)
In DepthDetails ArticlePubMed