BDBM50135070 (S)-1-(2,6-Diamino-hexanoyl)-pyrrolidine-2-carbonitrile::CHEMBL16680
SMILES NCCCCC(N)C(=O)N1CCC[C@H]1C#N
InChI Key InChIKey=BEXSRKUIBIGLOG-RGURZIINSA-N
Data  2 IC50
  Tab Delimited (TSV)   2D SDfile   Computed 3D by Vconf -m prep SDfile
Find this compound or compounds like it in BindingDB:
Activity Spreadsheet -- Enzyme Inhibition Constant Data from BindingDB
Found 2 hits for monomerid = 50135070
TargetDipeptidyl peptidase 2(Homo sapiens (Human))
University Of Antwerp (Uia)
Curated by ChEMBL
LigandPNGBDBM50135070((S)-1-(2,6-Diamino-hexanoyl)-pyrrolidine-2-carboni...)
Affinity DataIC50:  1.00E+3nM. Assay description: Inhibitory activity of compound against Dipeptidylpeptidase II (DPP II)
In DepthDetails ArticlePubMed
TargetDipeptidyl peptidase 4(Homo sapiens (Human))
University Of Antwerp (Uia)
Curated by ChEMBL
LigandPNGBDBM50135070((S)-1-(2,6-Diamino-hexanoyl)-pyrrolidine-2-carboni...)
Affinity DataIC50:  320nM. Assay description: Inhibitory activity against Dipeptidylpeptidase IV (DPP IV)
In DepthDetails ArticlePubMed