BDBM50135085 2,5-Diamino-1-thiazolidin-3-yl-pentan-1-one::CHEMBL148954
SMILES NCCCC(N)C(=O)N1CCSC1
InChI Key InChIKey=UUHJOLDDPKIPEA-UHFFFAOYSA-N
Data  2 IC50
  Tab Delimited (TSV)   2D SDfile   Computed 3D by Vconf -m prep SDfile
Find this compound or compounds like it in BindingDB:
Activity Spreadsheet -- Enzyme Inhibition Constant Data from BindingDB
Found 2 hits for monomerid = 50135085
TargetDipeptidyl peptidase 2(Homo sapiens (Human))
University Of Antwerp (Uia)
Curated by ChEMBL
LigandPNGBDBM50135085(2,5-Diamino-1-thiazolidin-3-yl-pentan-1-one | CHEM...)
Affinity DataIC50:  750nM. Assay description: Inhibitory activity of compound against Dipeptidylpeptidase II (DPP II)
In DepthDetails ArticlePubMed
TargetDipeptidyl peptidase 4(Homo sapiens (Human))
University Of Antwerp (Uia)
Curated by ChEMBL
LigandPNGBDBM50135085(2,5-Diamino-1-thiazolidin-3-yl-pentan-1-one | CHEM...)
Affinity DataIC50:  8.10E+4nM. Assay description: Inhibitory activity against Dipeptidylpeptidase IV (DPP IV)
In DepthDetails ArticlePubMed