BDBM50135086 (1S,2S,4S,5R)-5-((1E)-2-Bromovinyl)-1-[4-hydroxy-5-(hydroxymethyl)bicyclo[3.1.0]hex-2-yl]-1,3-dihydropyrimidine-2,4-dione::5-((E)-2-Bromo-vinyl)-1-((1R,3S,4S,6S)-4-hydroxy-5-hydroxymethyl-bicyclo[3.1.0]hex-2-yl)-1H-pyrimidine-2,4-dione::5-(2-Bromo-vinyl)-1-((1S,2S,4S,5R)-4-hydroxy-5-hydroxymethyl-bicyclo[3.1.0]hex-2-yl)-1H-pyrimidine-2,4-dione::CHEMBL146350
SMILES OC[C@@]12C[C@@H]1[C@H](C[C@@H]2O)n1cc(C=CBr)c(=O)[nH]c1=O
InChI Key InChIKey=DNFFZQMJVSAHIL-QYTUQVAYSA-N
Data  1 KI
  Tab Delimited (TSV)   2D SDfile   Computed 3D by Vconf -m prep SDfile
Find this compound or compounds like it in BindingDB:
Activity Spreadsheet -- Enzyme Inhibition Constant Data from BindingDB
Found 1 hit for monomerid = 50135086
TargetThymidine kinase, cytosolic(Homo sapiens (Human))
National Cancer Institute-Frederick
Curated by ChEMBL
LigandPNGBDBM50135086((1S,2S,4S,5R)-5-((1E)-2-Bromovinyl)-1-[4-hydroxy-5...)
Affinity DataKi:  6.29E+4nM. Assay description: Binding affinity constant against HSV-1 thymidine kinase
In DepthDetails ArticlePubMed