BDBM50135214 CHEMBL3747661
SMILES COc1ccc(CNC(=O)Nc2nc(C)c(s2)C(C)=O)cc1
InChI Key InChIKey=WIOFZLMIWUBUJO-UHFFFAOYSA-N
Data  2 IC50
  Tab Delimited (TSV)   2D SDfile   Computed 3D by Vconf -m prep SDfile
Find this compound or compounds like it in BindingDB:
Activity Spreadsheet -- Enzyme Inhibition Constant Data from BindingDB
Found 2 hits for monomerid = 50135214
TargetGlycogen synthase kinase-3 beta(Homo sapiens (Human))
Centro De Investigaciones Biologicas (Cib, Csic)
Curated by ChEMBL
LigandPNGBDBM50135214(CHEMBL3747661)
Affinity DataIC50:  600nM. Assay description: Inhibition of human recombinant GSK3beta expressed in Escherichia coli using GS-1 as substrate incubated for 20 mins by gamma[32P]ATP-based scintilla...
In DepthDetails ArticlePubMed
TargetGlycogen synthase kinase-3(Homo sapiens (Human))
Central University
Curated by ChEMBL
LigandPNGBDBM50135214(CHEMBL3747661)
Affinity DataIC50:  400nM. Assay description: Competitive inhibition of glycogen synthase kinase-3 (unknown origin) in presence of ATP
In DepthDetails ArticlePubMed