BDBM50135224 CHEMBL3747778
SMILES [H][C@@]12Oc3c4c(C[C@@]5([H])N(C)CC[C@@]14[C@]51C[C@H](C(=O)NCCCCCCNC(=O)OC(C)(C)C)[C@]2(OC)C=C1)ccc3O
InChI Key InChIKey=DNVSPOULYYBPLY-WUHZNUJESA-N
Data  1 KI
  Tab Delimited (TSV)   2D SDfile   Computed 3D by Vconf -m prep SDfile
Find this compound or compounds like it in BindingDB:
Activity Spreadsheet -- Enzyme Inhibition Constant Data from BindingDB
Found 1 hit for monomerid = 50135224
TargetMu-type opioid receptor(Homo sapiens (Human))
University Of Nottingham
Curated by ChEMBL
LigandPNGBDBM50135224(CHEMBL3747778)
Affinity DataKi:  7.40nM. Assay description: Displacement of [3H]diprenorphine from human MOR expressed in CHO-FlpIn cell membranes after 1 hr by liquid scintillation counting analysis
In DepthDetails ArticlePubMed