BDBM50135287 CHEMBL3746910
SMILES Cn1c2nc(Nc3ccc4[nH]ccc4c3)ncc2cc(c1=O)S(=O)(=O)c1ccccc1
InChI Key InChIKey=QVFCEFCQUNKANC-UHFFFAOYSA-N
Data  1 IC50
  Tab Delimited (TSV)   2D SDfile   Computed 3D by Vconf -m prep SDfile
Find this compound or compounds like it in BindingDB:
Activity Spreadsheet -- Enzyme Inhibition Constant Data from BindingDB
Found 1 hit for monomerid = 50135287
TargetSerine/threonine-protein kinase PLK2(Homo sapiens (Human))
Icahn School Of Medicine At Mount Sinai
Curated by ChEMBL
LigandPNGBDBM50135287(CHEMBL3746910)
Affinity DataIC50:  1.23E+3nM. Assay description: Inhibition of human recombinant PLK2 using recombinant dephosphorylated bovine alpha- casein as substrate after 30 mins by scintillation counting ana...
In DepthDetails ArticlePubMed