BDBM50135310 6-Benzylamino-1-(2,6-dichloro-phenyl)-3,4-dihydro-1H-pyrido[3,2-d]pyrimidin-2-one::CHEMBL335878
SMILES Clc1cccc(Cl)c1N1C(=O)NCc2nc(NCc3ccccc3)ccc12
InChI Key InChIKey=MMTMXZSEBRNKFX-UHFFFAOYSA-N
Data  2 IC50
  Tab Delimited (TSV)   2D SDfile   Computed 3D by Vconf -m prep SDfile
Find this compound or compounds like it in BindingDB:
Activity Spreadsheet -- Enzyme Inhibition Constant Data from BindingDB
Found 2 hits for monomerid = 50135310
TargetMitogen-activated protein kinase 11(Homo sapiens (Human))
Merck Research Laboratories
Curated by ChEMBL
LigandPNGBDBM50135310(6-Benzylamino-1-(2,6-dichloro-phenyl)-3,4-dihydro-...)
Affinity DataIC50:  980nM. Assay description: Inhibitory activity against mitogen-activated protein kinase p38 beta
In DepthDetails ArticlePubMed
TargetMitogen-activated protein kinase 14(Homo sapiens (Human))
Merck Research Laboratories
Curated by ChEMBL
LigandPNGBDBM50135310(6-Benzylamino-1-(2,6-dichloro-phenyl)-3,4-dihydro-...)
Affinity DataIC50:  113nM. Assay description: Inhibitory activity against Mitogen-activated protein kinase p38 alpha
In DepthDetails ArticlePubMed