BDBM50135419 2-(5-{4-[(Biphenyl-2-carbonyl)-amino]-benzoyl}-2,3,4,5-tetrahydro-benzo[b][1,4]thiazepin-2-yl)-ethanesulfonic acid::CHEMBL131439
SMILES OS(=O)(=O)CCC1CCN(C(=O)c2ccc(NC(=O)c3ccccc3-c3ccccc3)cc2)c2ccccc2S1
InChI Key InChIKey=BXVMVOZCTIQAAB-UHFFFAOYSA-N
Data  2 IC50
  Tab Delimited (TSV)   2D SDfile   Computed 3D by Vconf -m prep SDfile
Find this compound or compounds like it in BindingDB:
Activity Spreadsheet -- Enzyme Inhibition Constant Data from BindingDB
Found 2 hits for monomerid = 50135419
TargetVasopressin V1a receptor(Homo sapiens (Human))
Johnson & Johnson Pharmaceutical Research & Development
Curated by ChEMBL
LigandPNGBDBM50135419(2-(5-{4-[(Biphenyl-2-carbonyl)-amino]-benzoyl}-2,3...)
Affinity DataIC50:  1.15E+3nM. Assay description: Ability of the compound to displace [3H]-arginine vasopressin in cloned human V1a receptor
In DepthDetails ArticlePubMed
TargetVasopressin V2 receptor(Homo sapiens (Human))
Johnson & Johnson Pharmaceutical Research & Development
Curated by ChEMBL
LigandPNGBDBM50135419(2-(5-{4-[(Biphenyl-2-carbonyl)-amino]-benzoyl}-2,3...)
Affinity DataIC50:  12nM. Assay description: Ability to displace [3H]-arginine vasopressin in cloned human V2 receptor
In DepthDetails ArticlePubMed