BDBM50135588 (S)-3-(3,4-Difluoro-phenyl)-N-[(S)-5-(2,3-dihydro-benzo[1,4]dioxin-6-yl)-1-methyl-2-oxo-2,3-dihydro-1H-benzo[e][1,4]diazepin-3-yl]-2-methyl-propionamide::CHEMBL341257
SMILES C[C@@H](Cc1ccc(F)c(F)c1)C(=O)N[C@H]1N=C(c2ccc3OCCOc3c2)c2ccccc2N(C)C1=O
InChI Key InChIKey=OMFRRAXMRSWCKR-YHAMSUFESA-N
Data  1 IC50
  Tab Delimited (TSV)   2D SDfile   Computed 3D by Vconf -m prep SDfile
Find this compound or compounds like it in BindingDB:
Activity Spreadsheet -- Enzyme Inhibition Constant Data from BindingDB
Found 1 hit for monomerid = 50135588
LigandPNGBDBM50135588((S)-3-(3,4-Difluoro-phenyl)-N-[(S)-5-(2,3-dihydro-...)
Affinity DataIC50:  4.70nM. Assay description: In vitro inhibition of gamma secretase.
In DepthDetails ArticlePubMed