BDBM50135744 CHEMBL3753034
SMILES [H][C@@]12CC[C@H](O)[C@@]1(C)CC[C@]1([H])c3ccc(O)cc3[C@H](C)C[C@@]21[H]
InChI Key InChIKey=GIWQIXCJHHWPIT-WWELPLAASA-N
Data  1 KI
  Tab Delimited (TSV)   2D SDfile   Computed 3D by Vconf -m prep SDfile
Find this compound or compounds like it in BindingDB:
Activity Spreadsheet -- Enzyme Inhibition Constant Data from BindingDB
Found 1 hit for monomerid = 50135744
TargetAromatase(Homo sapiens (Human))
The M. S. University Of Baroda
Curated by ChEMBL
LigandPNGBDBM50135744(CHEMBL3753034)
Affinity DataKi:  100nM. Assay description: Competitive inhibition of human aromatase extracted from placental microsomes after 5 mins by Dixon plot analysis in presence of [1beta-3H]AD
In DepthDetails ArticlePubMed