BDBM50135813 CHEMBL149321::[(3,5-Dichloro-phenylamino)-hydroxy-phosphono-methyl]-phosphonic acid
SMILES OC(Nc1cc(Cl)cc(Cl)c1)(P(O)(O)=O)P(O)(O)=O
InChI Key InChIKey=VYRYXBZGNQRZTL-UHFFFAOYSA-N
Data  1 KI  2 IC50
  Tab Delimited (TSV)   2D SDfile   Computed 3D by Vconf -m prep SDfile
Find this compound or compounds like it in BindingDB:
Activity Spreadsheet -- Enzyme Inhibition Constant Data from BindingDB
Found 3 hits for monomerid = 50135813
TargetFarnesyl pyrophosphate synthase(Homo sapiens (Human))
University Of Illinois At Urbana-Champaign
Curated by ChEMBL
LigandPNGBDBM50135813(CHEMBL149321 | [(3,5-Dichloro-phenylamino)-hydroxy...)
Affinity DataKi:  4.10E+3nM. Assay description: Binding affinity towards farnesyl Pyrophosphate Synthase using [14C]- isopentenyl pyrophosphate as radioligand
In DepthDetails ArticlePubMed
TargetFarnesyl pyrophosphate synthase(Homo sapiens (Human))
University Of Illinois At Urbana-Champaign
Curated by ChEMBL
LigandPNGBDBM50135813(CHEMBL149321 | [(3,5-Dichloro-phenylamino)-hydroxy...)
Affinity DataIC50:  4.27E+4nM. Assay description: Inhibitory activity against farnesyl Pyrophosphate Synthase expressed as #NAME? (M)
In DepthDetails ArticlePubMed
TargetFarnesyl pyrophosphate synthase(Homo sapiens (Human))
University Of Illinois At Urbana-Champaign
Curated by ChEMBL
LigandPNGBDBM50135813(CHEMBL149321 | [(3,5-Dichloro-phenylamino)-hydroxy...)
Affinity DataIC50:  4.30E+4nM. Assay description: Inhibitory activity against farnesyl Pyrophosphate Synthase was determined
In DepthDetails ArticlePubMed