BDBM50136093 CHEMBL440912::Sulfamic acid benzyl ester
SMILES NS(=O)(=O)OCc1ccccc1
InChI Key InChIKey=LHKKUYDIFGSCGS-UHFFFAOYSA-N
Data  3 KI
  Tab Delimited (TSV)   2D SDfile   Computed 3D by Vconf -m prep SDfile
Find this compound or compounds like it in BindingDB:
Activity Spreadsheet -- Enzyme Inhibition Constant Data from BindingDB
Found 3 hits for monomerid = 50136093
TargetCarbonic anhydrase 2(Homo sapiens (Human))
University Of Montpellier
Curated by ChEMBL
LigandPNGBDBM50136093(CHEMBL440912 | Sulfamic acid benzyl ester)
Affinity DataKi:  3.40nM. Assay description: Inhibitory activity against human carbonic anhydrase II.
In DepthDetails ArticlePubMed
TargetCarbonic anhydrase 9(Homo sapiens (Human))
University Of Montpellier
Curated by ChEMBL
LigandPNGBDBM50136093(CHEMBL440912 | Sulfamic acid benzyl ester)
Affinity DataKi:  14nM. Assay description: Inhibitory activity against human carbonic anhydrase IX.
In DepthDetails ArticlePubMed
TargetCarbonic anhydrase 1(Homo sapiens (Human))
University Of Montpellier
Curated by ChEMBL
LigandPNGBDBM50136093(CHEMBL440912 | Sulfamic acid benzyl ester)
Affinity DataKi:  760nM. Assay description: Inhibitory activity against human carbonic anhydrase I.
In DepthDetails ArticlePubMed