BDBM50136335 (S)-4-((S)-2-{(S)-2-[(3S,4S)-4-((S)-2-Amino-3-carbamoyl-propionylamino)-3-hydroxy-6-methyl-heptanoylamino]-3-methyl-butyrylamino}-propionylamino)-4-((S)-1-carboxy-2-phenyl-ethylcarbamoyl)-butyric acid::CHEMBL137131
SMILES CC(C)C[C@H](NC(=O)[C@@H](N)CC(N)=O)[C@@H](O)CC(=O)N[C@@H](C(C)C)C(=O)N[C@@H](C)C(=O)N[C@@H](CCC(O)=O)C(=O)N[C@@H](Cc1ccccc1)C(O)=O
InChI Key InChIKey=COVANGFPLNQTMC-KWHDBERRSA-N
Data  1 IC50
  Tab Delimited (TSV)   2D SDfile   Computed 3D by Vconf -m prep SDfile
Find this compound or compounds like it in BindingDB:
Activity Spreadsheet -- Enzyme Inhibition Constant Data from BindingDB
Found 1 hit for monomerid = 50136335
TargetBeta-secretase 1(Homo sapiens (Human))
Eli Lilly
Curated by ChEMBL
LigandPNGBDBM50136335((S)-4-((S)-2-{(S)-2-[(3S,4S)-4-((S)-2-Amino-3-carb...)
Affinity DataIC50: >9.10E+4nM. Assay description: Inhibition of human beta-secretase
In DepthDetails ArticlePubMed