BDBM50136383 (4-chlorophenyl)(5-(3-chlorophenyl)tetrazolo[1,5-a]quinazolin-7-yl)(1-methyl-1H-imidazol-5-yl)methanamine::C-(4-Chloro-phenyl)-C-[5-(3-chloro-phenyl)-tetrazolo[1,5-a]quinazolin-7-yl]-C-(3-methyl-3H-imidazol-4-yl)-methylamine::CHEMBL341586
SMILES Cn1cncc1C(N)(c1ccc(Cl)cc1)c1ccc2c(c1)c(nc1nnnn21)-c1cccc(Cl)c1
InChI Key InChIKey=XKBOADWPZLOLCO-UHFFFAOYSA-N
Data  5 IC50
  Tab Delimited (TSV)   2D SDfile   Computed 3D by Vconf -m prep SDfile
Find this compound or compounds like it in BindingDB:
Activity Spreadsheet -- Enzyme Inhibition Constant Data from BindingDB
Found 5 hits for monomerid = 50136383
TargetProtein farnesyltransferase subunit beta/geranylgeranyltransferase type-1 subunit alpha(Homo sapiens (Human))
Medicinal Chemistry Department Johnson & Johnson Pharmaceutical Research & Development (J&Jprd)
Curated by ChEMBL
LigandPNGBDBM50136383((4-chlorophenyl)(5-(3-chlorophenyl)tetrazolo[1,5-a...)
Affinity DataIC50:  0.600nM. Assay description: Inhibition of [3H]-FPP incorporation into biotinylated laminB peptide by farnesyl transferase
In DepthDetails ArticlePubMed
TargetGeranylgeranyl transferase type-1 subunit beta/Protein farnesyltransferase/geranylgeranyltransferase type-1 subunit alpha(Homo sapiens (Human))
Medicinal Chemistry Department Johnson & Johnson Pharmaceutical Research & Development (J&Jprd)
Curated by ChEMBL
LigandPNGBDBM50136383((4-chlorophenyl)(5-(3-chlorophenyl)tetrazolo[1,5-a...)
Affinity DataIC50: >1.00E+3nM. Assay description: Inhibition of [3H]-FPP incorporation into biotinylated laminB peptide by farnesyl transferase
In DepthDetails ArticlePubMed
TargetProtein farnesyltransferase subunit beta/geranylgeranyltransferase type-1 subunit alpha(Homo sapiens (Human))
Medicinal Chemistry Department Johnson & Johnson Pharmaceutical Research & Development (J&Jprd)
Curated by ChEMBL
LigandPNGBDBM50136383((4-chlorophenyl)(5-(3-chlorophenyl)tetrazolo[1,5-a...)
Affinity DataIC50:  22nM. Assay description: Inhibition of Geranylgeranylprotein transferase-I catalyzed incorporation of [3H]-GGPP into biotinYRASNRSCAIL peptide at 10 uM
In DepthDetails ArticlePubMed
TargetProtein farnesyltransferase subunit beta/geranylgeranyltransferase type-1 subunit alpha(Homo sapiens (Human))
Medicinal Chemistry Department Johnson & Johnson Pharmaceutical Research & Development (J&Jprd)
Curated by ChEMBL
LigandPNGBDBM50136383((4-chlorophenyl)(5-(3-chlorophenyl)tetrazolo[1,5-a...)
Affinity DataIC50:  0.600nM. Assay description: Inhibition of Geranylgeranylprotein transferase-I catalyzed incorporation of [3H]-GGPP into biotinYRASNRSCAIL peptide
In DepthDetails ArticlePubMed
TargetGeranylgeranyl transferase type-1 subunit beta/Protein farnesyltransferase/geranylgeranyltransferase type-1 subunit alpha(Homo sapiens (Human))
Medicinal Chemistry Department Johnson & Johnson Pharmaceutical Research & Development (J&Jprd)
Curated by ChEMBL
LigandPNGBDBM50136383((4-chlorophenyl)(5-(3-chlorophenyl)tetrazolo[1,5-a...)
Affinity DataIC50:  461nM. Assay description: Inhibition of [3H]-FPP incorporation into biotinylated laminB peptide by farnesyl transferase
In DepthDetails ArticlePubMed