BDBM50136466 CHEMBL343492::Dimethyl-[2-(6-pyridin-3-yl-indol-1-yl)-ethyl]-amine
SMILES CN(C)CCn1ccc2ccc(cc12)-c1cccnc1
InChI Key InChIKey=BODASUORRGHPGV-UHFFFAOYSA-N
Data  1 KI
  Tab Delimited (TSV)   2D SDfile   Computed 3D by Vconf -m prep SDfile
Find this compound or compounds like it in BindingDB:
Activity Spreadsheet -- Enzyme Inhibition Constant Data from BindingDB
Found 1 hit for monomerid = 50136466
Target5-hydroxytryptamine receptor 1D(Homo sapiens (Human))
Nps Pharmaceuticals
Curated by ChEMBL
LigandPNGBDBM50136466(CHEMBL343492 | Dimethyl-[2-(6-pyridin-3-yl-indol-1...)
Affinity DataKi:  1.40nM. Assay description: Displacement of [3H]-5-HT from human 5-hydroxytryptamine 1D receptor expressed in Chinese hamster ovary cells (CHO cells)
In DepthDetails ArticlePubMed