BDBM50136545 CHEMBL3753596
SMILES CC(C)Cc1cc(cc(C)n1)-c1nc(no1)-c1cc(C)c(OC[C@H]2COC(=O)N2)cn1
InChI Key InChIKey=PWFGRQALJMGJSS-KRWDZBQOSA-N
Data  1 EC50
  Tab Delimited (TSV)   2D SDfile   Computed 3D by Vconf -m prep SDfile
Find this compound or compounds like it in BindingDB:
Activity Spreadsheet -- Enzyme Inhibition Constant Data from BindingDB
Found 1 hit for monomerid = 50136545
TargetSphingosine 1-phosphate receptor 1(Homo sapiens (Human))
Boehringer Ingelheim Pharmaceuticals
Curated by ChEMBL
LigandPNGBDBM50136545(CHEMBL3753596)
Affinity DataEC50:  63nM. Assay description: Agonist activity at human S1P1 receptor expressed in EDG1-bla U2OS cells incubated for 18 hrs prior to GenBlazer substrate addition by beta-arrestin ...
In DepthDetails ArticlePubMed