BDBM50136632 CHEMBL3752955
SMILES CNC[C@@H]1CC[C@@H](N1S(=O)(=O)c1cc(C)c(F)c(C)c1)c1ccc(F)cc1
InChI Key InChIKey=WDLWFHKRTNKWLQ-PKOBYXMFSA-N
Data  1 IC50
  Tab Delimited (TSV)   2D SDfile   Computed 3D by Vconf -m prep SDfile
Find this compound or compounds like it in BindingDB:
Activity Spreadsheet -- Enzyme Inhibition Constant Data from BindingDB
Found 1 hit for monomerid = 50136632
TargetTransient receptor potential cation channel subfamily A member 1(Homo sapiens (Human))
Genentech
Curated by ChEMBL
LigandPNGBDBM50136632(CHEMBL3752955)
Affinity DataIC50: >2.00E+4nM. Assay description: Inhibition of human TRPA1
In DepthDetails ArticlePubMed