BDBM50136691 CHEMBL139106::[3-(2-Methoxy-phenyl)-3-(naphthalen-1-yloxy)-propyl]-methyl-amine
SMILES CNCCC(Oc1cccc2ccccc12)c1ccccc1OC
InChI Key InChIKey=OZRCVSKLTROWSZ-UHFFFAOYSA-N
Data  1 KI
  Tab Delimited (TSV)   2D SDfile   Computed 3D by Vconf -m prep SDfile
Find this compound or compounds like it in BindingDB:
Activity Spreadsheet -- Enzyme Inhibition Constant Data from BindingDB
Found 1 hit for monomerid = 50136691
TargetSodium-dependent serotonin transporter(Homo sapiens (Human))
Eli Lilly
Curated by ChEMBL
LigandPNGBDBM50136691(CHEMBL139106 | [3-(2-Methoxy-phenyl)-3-(naphthalen...)
Affinity DataKi:  2.30nM. Assay description: Binding affinity to serotonin transporter, using [3H]-citalopram as radioligand
In DepthDetails ArticlePubMed