BDBM50137985 1-Isopropoxymethyl-9-(4-methyl-piperazin-1-yl)-4-thia-10a-aza-benzo[f]azulene::CHEMBL367875
SMILES CC(C)OCc1ccc2Sc3ccccc3C(=Cn12)N1CCN(C)CC1
InChI Key InChIKey=ABCRKPVZDDXKEX-UHFFFAOYSA-N
Data  4 KI
  Tab Delimited (TSV)   2D SDfile   Computed 3D by Vconf -m prep SDfile
Find this compound or compounds like it in BindingDB:
Activity Spreadsheet -- Enzyme Inhibition Constant Data from BindingDB
Found 4 hits for monomerid = 50137985
Target5-hydroxytryptamine receptor 2A(Rattus norvegicus (rat))
Universit£
Curated by ChEMBL
LigandPNGBDBM50137985(1-Isopropoxymethyl-9-(4-methyl-piperazin-1-yl)-4-t...)
Affinity DataKi:  217nM. Assay description: In vitro binding affinity towards 5-hydroxytryptamine 2A receptor in rat tissue homogenate using [3H]ketanserin as radioligand
In DepthDetails ArticlePubMed
TargetD(3) dopamine receptor(Rattus norvegicus (Rat))
Universit£
Curated by ChEMBL
LigandPNGBDBM50137985(1-Isopropoxymethyl-9-(4-methyl-piperazin-1-yl)-4-t...)
Affinity DataKi:  278nM. Assay description: In vitro binding affinity towards Dopamine receptor D3 in Sf9 cell membranes using [3H]7-OH-DPAT as radioligand
In DepthDetails ArticlePubMed
TargetD(2) dopamine receptor(Rattus norvegicus (rat))
Universit£
Curated by ChEMBL
LigandPNGBDBM50137985(1-Isopropoxymethyl-9-(4-methyl-piperazin-1-yl)-4-t...)
Affinity DataKi:  3.82E+3nM. Assay description: In vitro binding affinity towards Dopamine receptor D2 in rat tissue homogenate using [3H]-spiperone as radioligand
In DepthDetails ArticlePubMed
TargetD(1A) dopamine receptor(RAT)
Universit£
Curated by ChEMBL
LigandPNGBDBM50137985(1-Isopropoxymethyl-9-(4-methyl-piperazin-1-yl)-4-t...)
Affinity DataKi:  7.60E+3nM. Assay description: In vitro binding affinity towards Dopamine receptor D1 in rat tissue homogenate using [3H]-SCH- 23390 as radioligand
In DepthDetails ArticlePubMed