BDBM50138909 2-Chloro-N-[1-[3-(4-chloro-phenyl)-4-phenyl-4,5-dihydro-pyrazol-1-yl]-1-methylamino-meth-(E)-ylidene]-benzenesulfonamide::CHEMBL348550
SMILES CN=C(NS(=O)(=O)c1ccccc1Cl)N1CC(C(=N1)c1ccc(Cl)cc1)c1ccccc1
InChI Key InChIKey=YHEFFMMBNKEYRJ-UHFFFAOYSA-N
Data  2 KI
  Tab Delimited (TSV)   2D SDfile   Computed 3D by Vconf -m prep SDfile
Find this compound or compounds like it in BindingDB:
Activity Spreadsheet -- Enzyme Inhibition Constant Data from BindingDB
Found 2 hits for monomerid = 50138909
TargetCannabinoid receptor 1(Homo sapiens (Human))
Solvay Pharma
Curated by ChEMBL
LigandPNGBDBM50138909(2-Chloro-N-[1-[3-(4-chloro-phenyl)-4-phenyl-4,5-di...)
Affinity DataKi:  75.4nM. Assay description: Displacement of CP-55,940 binding from recombinant human cannabinoid receptor 1 expressed in CHO cells
In DepthDetails ArticlePubMed
TargetCannabinoid receptor 2(Homo sapiens (Human))
Solvay Pharma
Curated by ChEMBL
LigandPNGBDBM50138909(2-Chloro-N-[1-[3-(4-chloro-phenyl)-4-phenyl-4,5-di...)
Affinity DataKi: >1.00E+3nM. Assay description: Affinity to displace CP-55,940 binding from Cannabinoid receptor 2 of human expressed in CHO cells
In DepthDetails ArticlePubMed