BDBM50138926 CHEMBL443035::{2-Hydroxymethyl-4-[3-isopropyl-4-methyl-pent-(Z)-ylidene]-5-oxo-tetrahydro-furan-2-yl}-acetic acid nonyl ester
SMILES CCCCCCCCCOC(=O)CC1(CO)C\C(=C\CC(C(C)C)C(C)C)C(=O)O1
InChI Key InChIKey=AMSRIEZDPSEPKY-BKUYFWCQSA-N
Data  1 KI
  Tab Delimited (TSV)   2D SDfile   Computed 3D by Vconf -m prep SDfile
Find this compound or compounds like it in BindingDB:
Activity Spreadsheet -- Enzyme Inhibition Constant Data from BindingDB
Found 1 hit for monomerid = 50138926
TargetProtein kinase C alpha type(Homo sapiens (Human))
National Cancer Institute-Frederick
Curated by ChEMBL
LigandPNGBDBM50138926(CHEMBL443035 | {2-Hydroxymethyl-4-[3-isopropyl-4-m...)
Affinity DataKi:  56nM. Assay description: Displacement of [20-3H]-phorbol 12,13-dibutyrate (PDBU) from protein kinase C alpha with phosphatidylserine
In DepthDetails ArticlePubMed