BDBM50139320 CHEMBL158702::N-[(R)-2-(4-{3-[4-(5-Cyclopentylmethyl-[1,2,4]oxadiazol-3-yl)-3-fluoro-phenoxy]-propyl}-piperazin-1-yl)-1-methyl-2-oxo-ethyl]-2-(3-fluoro-phenyl)-acetamide
SMILES C[C@@H](NC(=O)c1cccc(F)c1)C(=O)N1CCN(CCCOc2ccc(-c3noc(CC4CCCC4)n3)c(F)c2)CC1
InChI Key InChIKey=GOPBYLBBVXWEQA-OAQYLSRUSA-N
Data  2 KI
  Tab Delimited (TSV)   2D SDfile   Computed 3D by Vconf -m prep SDfile
Find this compound or compounds like it in BindingDB:
Activity Spreadsheet -- Enzyme Inhibition Constant Data from BindingDB
Found 2 hits for monomerid = 50139320
TargetHistamine H3 receptor(Rattus norvegicus (rat))
Abbott Laboratories
Curated by ChEMBL
LigandPNGBDBM50139320(CHEMBL158702 | N-[(R)-2-(4-{3-[4-(5-Cyclopentylmet...)
Affinity DataKi:  3.80nM. Assay description: Binding affinity for rat histamine H3 receptor on rat cortical cells
In DepthDetails ArticlePubMed
TargetHistamine H3 receptor(Homo sapiens (Human))
Abbott Laboratories
Curated by ChEMBL
LigandPNGBDBM50139320(CHEMBL158702 | N-[(R)-2-(4-{3-[4-(5-Cyclopentylmet...)
Affinity DataKi:  18nM. Assay description: Binding affinity for human histamine H3 receptor on human colon cells
In DepthDetails ArticlePubMed