BDBM50139431 CHEMBL3765052
SMILES COc1cc(OC)c2c(c1)oc(cc2=O)N1CCN(Cc2ccc(SC(F)(F)F)cc2)CC1
InChI Key InChIKey=NMYZIYGOQKSRJI-UHFFFAOYSA-N
Data  3 IC50
  Tab Delimited (TSV)   2D SDfile   Computed 3D by Vconf -m prep SDfile
Find this compound or compounds like it in BindingDB:
Activity Spreadsheet -- Enzyme Inhibition Constant Data from BindingDB
Found 3 hits for monomerid = 50139431
TargetMultidrug resistance-associated protein 1(Homo sapiens (Human))
University Of Regensburg
Curated by ChEMBL
LigandPNGBDBM50139431(CHEMBL3765052)
Affinity DataIC50:  2.08E+4nM. Assay description: Inhibition of human MRP1 transfected in MDCK2 cells assessed as inhibition of calcein-AM efflux
In DepthDetails ArticlePubMed
TargetBroad substrate specificity ATP-binding cassette transporter ABCG2(Homo sapiens (Human))
University Of Regensburg
Curated by ChEMBL
LigandPNGBDBM50139431(CHEMBL3765052)
Affinity DataIC50: >1.00E+5nM. Assay description: Inhibition of ABCG2 in human MCF7/Topo cells by Hoechst 33342 assay
In DepthDetails ArticlePubMed
TargetATP-dependent translocase ABCB1(Homo sapiens (Human))
University Of Regensburg
Curated by ChEMBL
LigandPNGBDBM50139431(CHEMBL3765052)
Affinity DataIC50:  3.66E+4nM. Assay description: Inhibition of ABCB1 in human KBV1 cells assessed as inhibition of calcein-AM efflux
In DepthDetails ArticlePubMed