BDBM50139649 CHEMBL3764617
SMILES Cc1ccc(cc1)S(=O)(=O)Nc1ccccc1\C=N\c1ccccc1NS(=O)(=O)c1ccc(C)cc1
InChI Key InChIKey=FLDBNMYJUMAXDQ-TURZUDJPSA-N
Data  6 KI
  Tab Delimited (TSV)   2D SDfile   Computed 3D by Vconf -m prep SDfile
Find this compound or compounds like it in BindingDB:
Activity Spreadsheet -- Enzyme Inhibition Constant Data from BindingDB
Found 8 hits for monomerid = 50139649
TargetSphingosine kinase 2(Homo sapiens (Human))
Virginia Tech
Curated by ChEMBL
LigandPNGBDBM50139649(CHEMBL3764617)
Affinity DataKi:  6.90E+3nM. Assay description: Inhibition of recombinant human His6/HA-fusion-tagged SphK2 expressed in baculovirus infected sf9 insect cells using d-erythro-sphingosine as substra...
In DepthDetails ArticlePubMed
TargetSphingosine kinase 2(Homo sapiens (Human))
Virginia Tech
Curated by ChEMBL
LigandPNGBDBM50139649(CHEMBL3764617)
Affinity DataKi:  6.90E+3nM. Assay description: Inhibition of recombinant human SphK2 assessed as decrease in [33P]SIP production using sphingosine as substrate in presence of [gamma33P]-ATP by sci...
In DepthDetails ArticlePubMed
TargetSphingosine kinase 2(Homo sapiens (Human))
Virginia Tech
Curated by ChEMBL
LigandPNGBDBM50139649(CHEMBL3764617)
Affinity DataKi:  6.90E+3nM. Assay description: Inhibition of human SK2 using D-erythro sphingosine as substrate and gamma[33P]ATP by Lineweaver-Burk plot analysis
In DepthDetails ArticlePubMed
TargetSphingosine kinase 2(Homo sapiens (Human))
Virginia Tech
Curated by ChEMBL
LigandPNGBDBM50139649(CHEMBL3764617)
Affinity DataKi:  6.90E+3nM. Assay description: Antagonistic activity against (-)-noradrenaline-induced contraction of rat thoracic aorta (Alpha-1D adrenergic receptor)
In DepthDetails
TargetSphingosine kinase 1(Homo sapiens (Human))TBA
LigandPNGBDBM50139649(CHEMBL3764617)
Affinity DataKi:  2.70E+4nM. Assay description: Antagonistic activity against (-)-noradrenaline-induced contraction of rat thoracic aorta (Alpha-1D adrenergic receptor)
In DepthDetails
TargetSphingosine kinase 1(Homo sapiens (Human))TBA
LigandPNGBDBM50139649(CHEMBL3764617)
Affinity DataKi:  2.70E+4nM. Assay description: Inhibition of recombinant human SphK1 expressed in baculovirus infected Sf9 cells assessed as decrease in [33P]SIP production using D-erythro-sphingo...
In DepthDetails ArticlePubMed
TargetSphingosine kinase 1(Homo sapiens (Human))TBA
LigandPNGBDBM50139649(CHEMBL3764617)
Affinity DataKi:  2.70E+4nM. Assay description: Inhibition of human SK1 using D-erythro sphingosine as substrate and gamma[33P]ATP by Lineweaver-Burk plot analysis
In DepthDetails ArticlePubMed
TargetSphingosine kinase 1(Homo sapiens (Human))TBA
LigandPNGBDBM50139649(CHEMBL3764617)
Affinity DataKi:  2.70E+4nM. Assay description: Inhibition of recombinant human C-terminal TEV cleavage site-fused-His6-tagged SphK1 expressed in baculovirus infected sf9 insect cells using d-eryth...
In DepthDetails ArticlePubMed