BDBM50139792 6-Acetimidoylamino-2-amino-5-fluoro-hexanoic acid::CHEMBL172867
SMILES CC(=N)NCC(F)CCC(N)C(O)=O
InChI Key InChIKey=JCNDIEMMUWNKKT-UHFFFAOYSA-N
Data  3 IC50
  Tab Delimited (TSV)   2D SDfile   Computed 3D by Vconf -m prep SDfile
Find this compound or compounds like it in BindingDB:
Activity Spreadsheet -- Enzyme Inhibition Constant Data from BindingDB
Found 3 hits for monomerid = 50139792
TargetNitric oxide synthase, inducible(Homo sapiens (Human))
Pfizer
Curated by ChEMBL
LigandPNGBDBM50139792(6-Acetimidoylamino-2-amino-5-fluoro-hexanoic acid ...)
Affinity DataIC50:  7.84E+3nM. Assay description: InInhibition concentration against Inducible nitric oxide synthase (iNOS) at 10 uM concentration
In DepthDetails ArticlePubMed
TargetNitric oxide synthase, brain(Homo sapiens (Human))
Pfizer
Curated by ChEMBL
LigandPNGBDBM50139792(6-Acetimidoylamino-2-amino-5-fluoro-hexanoic acid ...)
Affinity DataIC50:  7.04E+4nM. Assay description: Inhibition concentration against Neuronal nitric oxide synthase (nNOS) at 10 uM concentration
In DepthDetails ArticlePubMed
TargetNitric oxide synthase, endothelial(Homo sapiens (Human))
Pfizer
Curated by ChEMBL
LigandPNGBDBM50139792(6-Acetimidoylamino-2-amino-5-fluoro-hexanoic acid ...)
Affinity DataIC50:  1.82E+5nM. Assay description: Inhibition concentration against Endothelial nitric oxide synthase (eNOS) at 10 uM concentration
In DepthDetails ArticlePubMed