BDBM50139797 (S)-6-Acetimidoylamino-2-amino-5,5-difluoro-hexanoic acid; dihydrochloride::CHEMBL535134
SMILES CC(=N)NCC(F)(F)CC[C@H](N)C(O)=O
InChI Key InChIKey=JHORPELCGUCENR-LURJTMIESA-N
Data  3 IC50
  Tab Delimited (TSV)   2D SDfile   Computed 3D by Vconf -m prep SDfile
Find this compound or compounds like it in BindingDB:
Activity Spreadsheet -- Enzyme Inhibition Constant Data from BindingDB
Found 3 hits for monomerid = 50139797
TargetNitric oxide synthase, brain(Homo sapiens (Human))
Pfizer
Curated by ChEMBL
LigandPNGBDBM50139797((S)-6-Acetimidoylamino-2-amino-5,5-difluoro-hexano...)
Affinity DataIC50:  3.38E+4nM. Assay description: Inhibition concentration against Neuronal nitric oxide synthase (nNOS) at 10 uM concentration
In DepthDetails ArticlePubMed
TargetNitric oxide synthase, inducible(Homo sapiens (Human))
Pfizer
Curated by ChEMBL
LigandPNGBDBM50139797((S)-6-Acetimidoylamino-2-amino-5,5-difluoro-hexano...)
Affinity DataIC50:  8.75E+3nM. Assay description: InInhibition concentration against Inducible nitric oxide synthase (iNOS) at 10 uM concentration
In DepthDetails ArticlePubMed
TargetNitric oxide synthase, endothelial(Homo sapiens (Human))
Pfizer
Curated by ChEMBL
LigandPNGBDBM50139797((S)-6-Acetimidoylamino-2-amino-5,5-difluoro-hexano...)
Affinity DataIC50:  5.75E+4nM. Assay description: Inhibition concentration against Endothelial nitric oxide synthase (eNOS) at 10 uM concentration
In DepthDetails ArticlePubMed