BDBM50139880 1-(4-Methoxy-benzyl)-8-(4-methoxy-benzyloxy)-6,7-dimethyl-1,6,7,8-tetrahydro-imidazo[4,5-e][1,2,4]triazepine::CHEMBL9234
SMILES COc1ccc(COC2N(C)N(C)C=Nc3ncn(Cc4ccc(OC)cc4)c23)cc1
InChI Key InChIKey=CLPKSEJPYWUGKC-UHFFFAOYSA-N
Data  1 KI
  Tab Delimited (TSV)   2D SDfile   Computed 3D by Vconf -m prep SDfile
Find this compound or compounds like it in BindingDB:
Activity Spreadsheet -- Enzyme Inhibition Constant Data from BindingDB
Found 1 hit for monomerid = 50139880
TargetAdenosine deaminase(Bos taurus (bovine))
University Of Maryland
Curated by ChEMBL
LigandPNGBDBM50139880(1-(4-Methoxy-benzyl)-8-(4-methoxy-benzyloxy)-6,7-d...)
Affinity DataKi:  7.70E+4nM. Assay description: Binding affinity towards calf spleen adenosine deaminase was determined
In DepthDetails ArticlePubMed