BDBM50140110 (R)-1-(2,6-difluorobenzyl)-5-(2-fluoro-3-methoxyphenyl)-6-methyl-3-(2-(pyridin-2-ylmethylamino)propyl)pyrimidine-2,4(1H,3H)-dione::1-(2,6-Difluoro-benzyl)-5-(2-fluoro-3-methoxy-phenyl)-6-methyl-3-{(R)-2-[(pyridin-2-ylmethyl)-amino]-propyl}-1H-pyrimidine-2,4-dione::CHEMBL23969
SMILES COc1cccc(c1F)-c1c(C)n(Cc2c(F)cccc2F)c(=O)n(C[C@@H](C)NCc2ccccn2)c1=O
InChI Key InChIKey=QEHGOBQYTLEROX-QGZVFWFLSA-N
Data  4 KI  1 IC50
  Tab Delimited (TSV)   2D SDfile   Computed 3D by Vconf -m prep SDfile
Find this compound or compounds like it in BindingDB:
Activity Spreadsheet -- Enzyme Inhibition Constant Data from BindingDB
Found 5 hits for monomerid = 50140110
TargetGonadotropin-releasing hormone receptor(Homo sapiens (Human))
Neurocrine Biosciences
Curated by ChEMBL
LigandPNGBDBM50140110((R)-1-(2,6-difluorobenzyl)-5-(2-fluoro-3-methoxyph...)
Affinity DataKi:  1.10nM. Assay description: Binding affinity at human GnRH receptor
In DepthDetails ArticlePubMed
TargetGonadotropin-releasing hormone receptor(Homo sapiens (Human))
Neurocrine Biosciences
Curated by ChEMBL
LigandPNGBDBM50140110((R)-1-(2,6-difluorobenzyl)-5-(2-fluoro-3-methoxyph...)
Affinity DataKi:  1.10nM. Assay description: Binding affinity evaluated by the ability to inhibit des-Gly10[125I]Tyr5,D-Leu6,NMeLeu7,Pro9-NEt]- Gonadotropin-releasing hormone binding to cloned h...
In DepthDetails ArticlePubMed
TargetGonadotropin-releasing hormone receptor(Homo sapiens (Human))
Neurocrine Biosciences
Curated by ChEMBL
LigandPNGBDBM50140110((R)-1-(2,6-difluorobenzyl)-5-(2-fluoro-3-methoxyph...)
Affinity DataKi:  43nM. Assay description: In vivo inhibition of monkey Gonadotropin-releasing hormone receptor
In DepthDetails ArticlePubMed
TargetGonadotropin-releasing hormone receptor(Rattus norvegicus)
Neurocrine Biosciences
Curated by ChEMBL
LigandPNGBDBM50140110((R)-1-(2,6-difluorobenzyl)-5-(2-fluoro-3-methoxyph...)
Affinity DataKi:  6.40E+3nM. Assay description: In vivo inhibition of rat Gonadotropin-releasing hormone receptor
In DepthDetails ArticlePubMed
TargetGonadotropin-releasing hormone receptor(Homo sapiens (Human))
Neurocrine Biosciences
Curated by ChEMBL
LigandPNGBDBM50140110((R)-1-(2,6-difluorobenzyl)-5-(2-fluoro-3-methoxyph...)
Affinity DataIC50:  0.5nM. Assay description: In vitro inhibition of [Ca2+] influx in RBL cells expressing Gonadotropin-releasing hormone receptor
In DepthDetails ArticlePubMed