BDBM50140271 CHEMBL3751961
SMILES COCCOc1cc(cnc1N)-c1ccc2nc(NC(C)=O)cn2n1
InChI Key InChIKey=DFSGJDVZSCMAOM-UHFFFAOYSA-N
Data  1 IC50  1 EC50
  Tab Delimited (TSV)   2D SDfile   Computed 3D by Vconf -m prep SDfile
Find this compound or compounds like it in BindingDB:
Activity Spreadsheet -- Enzyme Inhibition Constant Data from BindingDB
Found 2 hits for monomerid = 50140271
TargetPhosphatidylinositol 4,5-bisphosphate 3-kinase catalytic subunit alpha isoform(Homo sapiens (Human))
Novartis Institutes For Biomedical Research
Curated by ChEMBL
LigandPNGBDBM50140271(CHEMBL3751961)
Affinity DataIC50:  6nM. Assay description: Inhibition of PI3Kalpha (unknown origin) using 1 alpha-phosphatidylinositol as substrate assessed as ATP depletion after 5 mins by KinaseGlo assay
In DepthDetails ArticlePubMed
TargetPhosphatidylinositol 4,5-bisphosphate 3-kinase catalytic subunit alpha isoform(Homo sapiens (Human))
Novartis Institutes For Biomedical Research
Curated by ChEMBL
LigandPNGBDBM50140271(CHEMBL3751961)
Affinity DataEC50:  150nM. Assay description: Inhibition of PI3Kalpha in human A2780 cells assessed as reduction of AKT phosphorylation at Ser473 after 1 hr
In DepthDetails ArticlePubMed