BDBM50140290 4-(3-(3,5-dioxopiperazin-1-yl)butan-2-yl)piperazine-2,6-dione::4-[2-(3,5-dioxopiperazin-1-yl)-1-methylpropyl]piperazine-2,6-dione::CHEMBL275665::ICRF-193
SMILES CC(C(C)N1CC(=O)NC(=O)C1)N1CC(=O)NC(=O)C1
InChI Key InChIKey=OBYGAPWKTPDTAS-UHFFFAOYSA-N
Data  2 IC50
  Tab Delimited (TSV)   2D SDfile   Computed 3D by Vconf -m prep SDfile
Find this compound or compounds like it in BindingDB:
Activity Spreadsheet -- Enzyme Inhibition Constant Data from BindingDB
Found 2 hits for monomerid = 50140290
TargetDNA topoisomerase 2-alpha/2-beta(Homo sapiens (Human))
Toho University
Curated by ChEMBL
LigandPNGBDBM50140290(4-(3-(3,5-dioxopiperazin-1-yl)butan-2-yl)piperazin...)
Affinity DataIC50:  1.39E+4nM. Assay description: Inhibitory activity against human DNA topoisomerase II
In DepthDetails ArticlePubMed
TargetDNA topoisomerase 2-alpha(Homo sapiens (Human))
Toho University
Curated by ChEMBL
LigandPNGBDBM50140290(4-(3-(3,5-dioxopiperazin-1-yl)butan-2-yl)piperazin...)
Affinity DataIC50:  1.39E+4nM. Assay description: Inhibition of human topoisomerase 2
In DepthDetails ArticlePubMed