BDBM50140301 CHEMBL19026::N-{(1R,2R)-2-[2-(4-Phenyl-butyl)-2,3-dihydro-benzooxazol-7-yl]-cyclopropylmethyl}-butyramide
SMILES CCCC(=O)NC[C@@H]1C[C@H]1c1cccc2NC(CCCCc3ccccc3)Oc12
InChI Key InChIKey=VKTMPSYAAVEMEO-WXFOFVMLSA-N
Data  2 KI
  Tab Delimited (TSV)   2D SDfile   Computed 3D by Vconf -m prep SDfile
Find this compound or compounds like it in BindingDB:
Activity Spreadsheet -- Enzyme Inhibition Constant Data from BindingDB
Found 2 hits for monomerid = 50140301
TargetMelatonin receptor type 1A(Homo sapiens (Human))
Bristol-Myers Squibb Pharmaceutical Research Institute
Curated by ChEMBL
LigandPNGBDBM50140301(CHEMBL19026 | N-{(1R,2R)-2-[2-(4-Phenyl-butyl)-2,3...)
Affinity DataKi:  0.0500nM. Assay description: Binding of 2-[125I]-iodomelatonin to membrane preparations of NIH3T3 cells stably expressing human Melatonin receptor type 1A
In DepthDetails ArticlePubMed
TargetMelatonin receptor type 1B(Homo sapiens (Human))
Bristol-Myers Squibb Pharmaceutical Research Institute
Curated by ChEMBL
LigandPNGBDBM50140301(CHEMBL19026 | N-{(1R,2R)-2-[2-(4-Phenyl-butyl)-2,3...)
Affinity DataKi:  0.240nM. Assay description: Binding of 2-[125I]-iodomelatonin to membrane preparations of NIH3T3 cells stably expressing human Melatonin receptor type 1B
In DepthDetails ArticlePubMed