BDBM50140343 CHEMBL3754574
SMILES Nc1nc(cc(n1)-c1cccc(OC(=O)N(c2ccccc2)c2ccccc2)c1)-c1ccccc1
InChI Key InChIKey=KVVGKERAVCIPSV-UHFFFAOYSA-N
Data  2 KI
  Tab Delimited (TSV)   2D SDfile   Computed 3D by Vconf -m prep SDfile
Find this compound or compounds like it in BindingDB:
Activity Spreadsheet -- Enzyme Inhibition Constant Data from BindingDB
Found 2 hits for monomerid = 50140343
TargetAdenosine receptor A1(Rattus norvegicus (rat))
North-West University
Curated by ChEMBL
LigandPNGBDBM50140343(CHEMBL3754574)
Affinity DataKi:  11nM. Assay description: Displacement of [3H]DPCPX from adenosine A1 receptor in Sprague-Dawley rat whole brain after 1 hr by scintillation counting
In DepthDetails ArticlePubMed
TargetAdenosine receptor A2a(Rattus norvegicus (rat))
North-West University
Curated by ChEMBL
LigandPNGBDBM50140343(CHEMBL3754574)
Affinity DataKi:  451nM. Assay description: Displacement of [3H]NECA from adenosine A2A receptor in Sprague-Dawley rat striatal membrane after 1 hr by scintillation counting
In DepthDetails ArticlePubMed