BDBM50140562 CHEMBL3753044
SMILES O=c1cc(oc2cc(OCCCCCCCCN3CCCC3)ccc12)-c1cccc2ccccc12
InChI Key InChIKey=QCGVEJFICBTEIY-UHFFFAOYSA-N
Data  1 KI  2 IC50
  Tab Delimited (TSV)   2D SDfile   Computed 3D by Vconf -m prep SDfile
Find this compound or compounds like it in BindingDB:
Activity Spreadsheet -- Enzyme Inhibition Constant Data from BindingDB
Found 3 hits for monomerid = 50140562
TargetAcetylcholinesterase(Electrophorus electricus (Electric eel))
Henan University
Curated by ChEMBL
LigandPNGBDBM50140562(CHEMBL3753044)
Affinity DataKi:  206nM. Assay description: Mixed-type inhibition of electric eel AChE using ATC as substrate assessed as hydrolysis of ATC preincubated with protein for 15 mins followed by sub...
In DepthDetails ArticlePubMed
TargetAcetylcholinesterase(Electrophorus electricus (Electric eel))
Henan University
Curated by ChEMBL
LigandPNGBDBM50140562(CHEMBL3753044)
Affinity DataIC50:  720nM. Assay description: Inhibition of electric eel AChE using ATC as substrate preincubated for 15 mins followed by substrate addition measured at 1 min intervals by Ellman ...
In DepthDetails ArticlePubMed
TargetCholinesterase(Equus caballus (Horse))
Henan University
Curated by ChEMBL
LigandPNGBDBM50140562(CHEMBL3753044)
Affinity DataIC50:  420nM. Assay description: Inhibition of equine serum BChE using BTC as substrate preincubated for 15 mins followed by substrate addition measured at 1 min intervals by Ellman ...
In DepthDetails ArticlePubMed