BDBM50140665 (2S,5R,6R)-6-Mercapto-3,3-dimethyl-7-oxo-4-thia-1-aza-bicyclo[3.2.0]heptane-2-carboxylic acid::CHEMBL24351
SMILES CC1(C)S[C@@H]2[C@H](S)C(=O)N2[C@H]1C(O)=O
InChI Key InChIKey=WOYLBXUCZPJYOV-ALEPSDHESA-N
Data  4 IC50
  Tab Delimited (TSV)   2D SDfile   Computed 3D by Vconf -m prep SDfile
Find this compound or compounds like it in BindingDB:
Activity Spreadsheet -- Enzyme Inhibition Constant Data from BindingDB
Found 4 hits for monomerid = 50140665
TargetMetallo-beta-lactamase L1 type 3(Stenotrophomonas maltophilia)
Southern Methodist University
Curated by ChEMBL
LigandPNGBDBM50140665((2S,5R,6R)-6-Mercapto-3,3-dimethyl-7-oxo-4-thia-1-...)
Affinity DataIC50:  4.14E+4nM. Assay description: Beta-Lactamase Inhibition of metallo-beta-lactamase representative class B (L1) enzyme
In DepthDetails ArticlePubMed
TargetBeta-lactamase TEM(Escherichia coli)
Southern Methodist University
Curated by ChEMBL
LigandPNGBDBM50140665((2S,5R,6R)-6-Mercapto-3,3-dimethyl-7-oxo-4-thia-1-...)
Affinity DataIC50: >1.00E+6nM. Assay description: Beta-Lactamase inhibitory activity against representative class A (TEM-1) serine enzyme
In DepthDetails ArticlePubMed
TargetMetallo-beta-lactamase type 2(Bacillus cereus)
Southern Methodist University
Curated by ChEMBL
LigandPNGBDBM50140665((2S,5R,6R)-6-Mercapto-3,3-dimethyl-7-oxo-4-thia-1-...)
Affinity DataIC50:  4.14E+4nM. Assay description: Beta-Lactamase Inhibition of metallo-beta-lactamase representative class B (L1) enzyme
In DepthDetails ArticlePubMed
TargetBeta-lactamase(Escherichia coli)
Southern Methodist University
Curated by ChEMBL
LigandPNGBDBM50140665((2S,5R,6R)-6-Mercapto-3,3-dimethyl-7-oxo-4-thia-1-...)
Affinity DataIC50:  4.23E+4nM. Assay description: Beta-Lactamase inhibitory activity against representativeclass C (P99) serine enzyme
In DepthDetails ArticlePubMed