BDBM50140811 4-{4-[2-(4-Methoxy-phenyl)-ethyl]-piperazin-1-yl}-6,7,8,9-tetrahydro-pyrimido[4,5-b]indolizine-10-carbonitrile::CHEMBL26530
SMILES COc1ccc(CCN2CCN(CC2)c2ncnc3c(C#N)c4CCCCn4c23)cc1
InChI Key InChIKey=MLKDONXIFXRJQV-UHFFFAOYSA-N
Data  1 IC50
  Tab Delimited (TSV)   2D SDfile   Computed 3D by Vconf -m prep SDfile
Find this compound or compounds like it in BindingDB:
Activity Spreadsheet -- Enzyme Inhibition Constant Data from BindingDB
Found 1 hit for monomerid = 50140811
TargetMultidrug resistance-associated protein 1(Homo sapiens (Human))
Xenova
Curated by ChEMBL
LigandPNGBDBM50140811(4-{4-[2-(4-Methoxy-phenyl)-ethyl]-piperazin-1-yl}-...)
Affinity DataIC50: >5.00E+4nM. Assay description: Inhibitory activity against human transporter MRP1 (Multidrug resistance associated protein 1) expressed in COR.L23/R cell line
In DepthDetails ArticlePubMed