BDBM50140815 4-(Methyl-phenethyl-amino)-6,7,8,9-tetrahydro-pyrimido[4,5-b]indolizine-10-carbonitrile::CHEMBL27634
SMILES CN(CCc1ccccc1)c1ncnc2c(C#N)c3CCCCn3c12
InChI Key InChIKey=LKWFUKQMAMJMOY-UHFFFAOYSA-N
Data  2 IC50
  Tab Delimited (TSV)   2D SDfile   Computed 3D by Vconf -m prep SDfile
Find this compound or compounds like it in BindingDB:
Activity Spreadsheet -- Enzyme Inhibition Constant Data from BindingDB
Found 2 hits for monomerid = 50140815
TargetATP-dependent translocase ABCB1(Mus musculus)
Xenova
Curated by ChEMBL
LigandPNGBDBM50140815(4-(Methyl-phenethyl-amino)-6,7,8,9-tetrahydro-pyri...)
Affinity DataIC50:  3.30E+4nM. Assay description: Inhibitory activity against mouse transporter Pgp (P-glycoprotein) expressed in EMT6/AR1.0 cell line
In DepthDetails ArticlePubMed
TargetMultidrug resistance-associated protein 1(Homo sapiens (Human))
Xenova
Curated by ChEMBL
LigandPNGBDBM50140815(4-(Methyl-phenethyl-amino)-6,7,8,9-tetrahydro-pyri...)
Affinity DataIC50:  9.00E+3nM. Assay description: Inhibitory activity against human transporter MRP1 (Multidrug resistance associated protein 1) expressed in COR.L23/R cell line
In DepthDetails ArticlePubMed