BDBM50140816 10-(4,5-Dimethyl-thiazol-2-yl)-4-(4-phenethyl-piperazin-1-yl)-6,7,8,9-tetrahydro-pyrimido[4,5-b]indolizine::CHEMBL26892
SMILES Cc1nc(sc1C)-c1c2CCCCn2c2c(ncnc12)N1CCN(CCc2ccccc2)CC1
InChI Key InChIKey=QRCGJSMPOQYGMN-UHFFFAOYSA-N
Data  2 IC50
  Tab Delimited (TSV)   2D SDfile   Computed 3D by Vconf -m prep SDfile
Find this compound or compounds like it in BindingDB:
Activity Spreadsheet -- Enzyme Inhibition Constant Data from BindingDB
Found 2 hits for monomerid = 50140816
TargetATP-dependent translocase ABCB1(Mus musculus)
Xenova
Curated by ChEMBL
LigandPNGBDBM50140816(10-(4,5-Dimethyl-thiazol-2-yl)-4-(4-phenethyl-pipe...)
Affinity DataIC50:  6.00E+3nM. Assay description: Inhibitory activity against mouse transporter Pgp (P-glycoprotein) expressed in EMT6/AR1.0 cell line
In DepthDetails ArticlePubMed
TargetMultidrug resistance-associated protein 1(Homo sapiens (Human))
Xenova
Curated by ChEMBL
LigandPNGBDBM50140816(10-(4,5-Dimethyl-thiazol-2-yl)-4-(4-phenethyl-pipe...)
Affinity DataIC50:  533nM. Assay description: Inhibitory activity against human transporter MRP1 (Multidrug resistance associated protein 1) expressed in COR.L23/R cell line
In DepthDetails ArticlePubMed