BDBM50140938 CHEMBL3752778
SMILES Brc1c(Br)c(Br)c2n(CC#N)cnc2c1Br
InChI Key InChIKey=XDYDJHZXFPYEQZ-UHFFFAOYSA-N
Data  1 KI
  Tab Delimited (TSV)   2D SDfile   Computed 3D by Vconf -m prep SDfile
Find this compound or compounds like it in BindingDB:
Activity Spreadsheet -- Enzyme Inhibition Constant Data from BindingDB
Found 1 hit for monomerid = 50140938
TargetCasein kinase II subunit alpha(Homo sapiens (Human))
Warsaw University Of Technology
Curated by ChEMBL
LigandPNGBDBM50140938(CHEMBL3752778)
Affinity DataKi:  1.27E+3nM. Assay description: Inhibition of recombinant human CK2alpha using RRRDDDSDDD substrate peptide by scintillation counter in presence of [32P]ATP
In DepthDetails ArticlePubMed