BDBM50141000 2-[5-(2,6-Dioxo-1,3-dipropyl-2,3,6,7-tetrahydro-1H-purin-8-yl)-1-methyl-1H-pyrazol-3-yloxy]-N-pyridin-4-yl-acetamide::CHEMBL286420
SMILES CCCn1c2nc([nH]c2c(=O)n(CCC)c1=O)-c1cc(OCC(=O)Nc2ccncc2)nn1C
InChI Key InChIKey=JDPWNPWAQWVCNH-UHFFFAOYSA-N
Data  4 KI
  Tab Delimited (TSV)   2D SDfile   Computed 3D by Vconf -m prep SDfile
Find this compound or compounds like it in BindingDB:
Activity Spreadsheet -- Enzyme Inhibition Constant Data from BindingDB
Found 4 hits for monomerid = 50141000
TargetAdenosine receptor A2b(Homo sapiens (Human))
Universit£
Curated by ChEMBL
LigandPNGBDBM50141000(2-[5-(2,6-Dioxo-1,3-dipropyl-2,3,6,7-tetrahydro-1H...)
Affinity DataKi:  41nM. Assay description: Binding affinity of compound for displacement of specific [3H]- DPCPX binding at human A2B receptors expressed in HEK293 cells
In DepthDetails ArticlePubMed
TargetAdenosine receptor A1(Homo sapiens (Human))
Universit£
Curated by ChEMBL
LigandPNGBDBM50141000(2-[5-(2,6-Dioxo-1,3-dipropyl-2,3,6,7-tetrahydro-1H...)
Affinity DataKi:  955nM. Assay description: Displacement of specific [3H]DPCPX binding at human adenosine A1 receptor expressed in CHO cells
In DepthDetails ArticlePubMed
TargetAdenosine receptor A3(Homo sapiens (Human))
Universit£
Curated by ChEMBL
LigandPNGBDBM50141000(2-[5-(2,6-Dioxo-1,3-dipropyl-2,3,6,7-tetrahydro-1H...)
Affinity DataKi: >1.00E+3nM. Assay description: Binding affinity of compound for displacement of specific [3H]MRE3008-F20 binding at human A3 receptors expressed in CHO cells
In DepthDetails ArticlePubMed
TargetAdenosine receptor A2a(Homo sapiens (Human))
Universit£
Curated by ChEMBL
LigandPNGBDBM50141000(2-[5-(2,6-Dioxo-1,3-dipropyl-2,3,6,7-tetrahydro-1H...)
Affinity DataKi: >1.00E+3nM. Assay description: Binding affinity of compound for displacement of specific [3H]ZM-241385 binding at human adenosine A2A receptor expressed in CHO cells
In DepthDetails ArticlePubMed