BDBM50141022 1N-(1-carbamoyl-2-hydroxypropyl)-7-[3-amino(imino)methylaminopropyl]-16-(1-amino-2-phenylethylcarboxamido)-10-benzyl-4-(1H-3-indolylmethyl)-13-(2-methyl-1H-5-imidazolylmethyl)-3,6,9,12,15,19-hexaoxo-2,5,8,11,14,20-hexaazacyclotetracosane-1-carbox::CHEMBL427814
SMILES C[C@@H](O)[C@H](NC(=O)[C@H]1CCCCNC(=O)CC[C@H](NC(=O)[C@H](N)Cc2ccccc2)C(=O)N[C@@H](Cc2cnc(C)[nH]2)C(=O)N[C@@H](Cc2ccccc2)C(=O)N[C@@H](CCCNC(N)=N)C(=O)N[C@H](Cc2c[nH]c3ccccc23)C(=O)N1)C(N)=O
InChI Key InChIKey=JYZUNUUQCBCNGE-IMBOPAGWSA-N
Data  1 EC50
  Tab Delimited (TSV)   2D SDfile   Computed 3D by Vconf -m prep SDfile
Find this compound or compounds like it in BindingDB:
Activity Spreadsheet -- Enzyme Inhibition Constant Data from BindingDB
Found 1 hit for monomerid = 50141022
TargetMelanocyte-stimulating hormone receptor(Homo sapiens (Human))
University Of Arizona
Curated by ChEMBL
LigandPNGBDBM50141022(1N-(1-carbamoyl-2-hydroxypropyl)-7-[3-amino(imino)...)
Affinity DataEC50:  1nM. Assay description: Effective concentration required for maximum agonist response at melanocortin 1 receptor from frog skin.
In DepthDetails ArticlePubMed