BDBM50141052 3-[4-(2-Ethyl-5,7-dimethyl-imidazo[4,5-b]pyridin-3-ylmethyl)-phenyl]-5-isobutyl-thiophene-2-sulfonic acid diphenylacetyl-amide::CHEMBL415875
SMILES CCc1nc2c(C)cc(C)nc2n1Cc1ccc(cc1)-c1cc(CC(C)C)sc1S(=O)(=O)NC(=O)C(c1ccccc1)c1ccccc1
InChI Key InChIKey=YFGFVMIVJMMSMA-UHFFFAOYSA-N
Data  1 KI
  Tab Delimited (TSV)   2D SDfile   Computed 3D by Vconf -m prep SDfile
Find this compound or compounds like it in BindingDB:
Activity Spreadsheet -- Enzyme Inhibition Constant Data from BindingDB
Found 1 hit for monomerid = 50141052
TargetType-2 angiotensin II receptor(Homo sapiens (Human))
Uppsala University
Curated by ChEMBL
LigandPNGBDBM50141052(3-[4-(2-Ethyl-5,7-dimethyl-imidazo[4,5-b]pyridin-3...)
Affinity DataKi: >1.00E+4nM. Assay description: Binding affinity at Angiotensin II receptor, type 2 in pig uterus myometrial membranes by [125I]-Ang II displacement.
In DepthDetails ArticlePubMed