BDBM50141343 3-{3-Chloro-4-[3-(1,4,5,6-tetrahydro-pyrimidin-2-ylamino)-benzoylamino]-phenyl}-acrylic acid::CHEMBL36457
SMILES OC(=O)C=Cc1ccc(NC(=O)c2cccc(NC3=NCCCN3)c2)c(Cl)c1
InChI Key InChIKey=KNVMGBKMZYKHLR-UHFFFAOYSA-N
Data  5 IC50
  Tab Delimited (TSV)   2D SDfile   Computed 3D by Vconf -m prep SDfile
Find this compound or compounds like it in BindingDB:
Activity Spreadsheet -- Enzyme Inhibition Constant Data from BindingDB
Found 5 hits for monomerid = 50141343
TargetIntegrin alpha-V/beta-1(Homo sapiens (Human))
Pfizer
Curated by ChEMBL
LigandPNGBDBM50141343(3-{3-Chloro-4-[3-(1,4,5,6-tetrahydro-pyrimidin-2-y...)
Affinity DataIC50:  85nM. Assay description: Binding affinity towards alpha IIb/beta3 integrin by solid-phase receptor binding assay (SPRA)
In DepthDetails ArticlePubMed
TargetIntegrin alpha-IIb/beta-3(Homo sapiens (Human))
Pfizer
Curated by ChEMBL
LigandPNGBDBM50141343(3-{3-Chloro-4-[3-(1,4,5,6-tetrahydro-pyrimidin-2-y...)
Affinity DataIC50:  233nM. Assay description: Binding affinity towards alpha V/beta3 receptor by solid-phase receptor binding assays (SPRA)
In DepthDetails ArticlePubMed
TargetIntegrin alpha-V/beta-5(Homo sapiens (Human))
Pfizer
Curated by ChEMBL
LigandPNGBDBM50141343(3-{3-Chloro-4-[3-(1,4,5,6-tetrahydro-pyrimidin-2-y...)
Affinity DataIC50:  13nM. Assay description: Binding affinity towards alpha IIb/beta3 integrin by solid-phase receptor binding assay (SPRA)
In DepthDetails ArticlePubMed
TargetIntegrin alpha-V/beta-3(Homo sapiens (Human))
Pfizer
Curated by ChEMBL
LigandPNGBDBM50141343(3-{3-Chloro-4-[3-(1,4,5,6-tetrahydro-pyrimidin-2-y...)
Affinity DataIC50:  1.70nM. Assay description: Binding affinity towards alpha V-beta3 receptor expressed in HEK293 cells
In DepthDetails ArticlePubMed
TargetIntegrin alpha-V/beta-3(Homo sapiens (Human))
Pfizer
Curated by ChEMBL
LigandPNGBDBM50141343(3-{3-Chloro-4-[3-(1,4,5,6-tetrahydro-pyrimidin-2-y...)
Affinity DataIC50:  0.480nM. Assay description: Binding affinity towards alpha V-beta1 receptor expressed in HEK293 cells
In DepthDetails ArticlePubMed