BDBM50141507 CHEMBL37663::{4-[(E)-3-(5-Benzo[b]thiophen-2-yl-2,4-dimethoxy-phenyl)-acryloyl]-phenylsulfanyl}-acetic acid
SMILES COc1cc(OC)c(cc1\C=C\C(=O)c1ccc(SCC(O)=O)cc1)-c1cc2ccccc2s1
InChI Key InChIKey=JRYUYYMRKLOMFN-FMIVXFBMSA-N
Data  1 IC50
  Tab Delimited (TSV)   2D SDfile   Computed 3D by Vconf -m prep SDfile
Find this compound or compounds like it in BindingDB:
Activity Spreadsheet -- Enzyme Inhibition Constant Data from BindingDB
Found 1 hit for monomerid = 50141507
TargetTumor necrosis factor receptor superfamily member 1A(Homo sapiens (Human))
Atherogenics
Curated by ChEMBL
LigandPNGBDBM50141507(CHEMBL37663 | {4-[(E)-3-(5-Benzo[b]thiophen-2-yl-2...)
Affinity DataIC50:  1.00E+3nM. Assay description: Inhibition of TNF-alpha-induced VCAM-1 expression
In DepthDetails ArticlePubMed