BDBM50141685 (S)-2-((S)-3-Amino-4-benzylsulfanyl-2-hydroxy-butyrylamino)-propionic acid ethyl ester::CHEMBL169482
SMILES CCOC(=O)[C@H](C)NC(=O)C(O)[C@H](N)CSCc1ccccc1
InChI Key InChIKey=WAUFRWRDADWDFP-MKDGSZCOSA-N
Data  1 IC50
  Tab Delimited (TSV)   2D SDfile   Computed 3D by Vconf -m prep SDfile
Find this compound or compounds like it in BindingDB:
Activity Spreadsheet -- Enzyme Inhibition Constant Data from BindingDB
Found 1 hit for monomerid = 50141685
TargetMethionine aminopeptidase 2(Homo sapiens (Human))
Abbott Laboratories
Curated by ChEMBL
LigandPNGBDBM50141685((S)-2-((S)-3-Amino-4-benzylsulfanyl-2-hydroxy-buty...)
Affinity DataIC50:  5.10E+4nM. Assay description: Inhibitory activity against human methionine aminopeptidase-2
In DepthDetails ArticlePubMed