BDBM50141885 2-{3-[4-(5-Benzyl-2-ethyl-2H-pyrazol-3-yl)-piperidin-1-ylmethyl]-4-phenyl-pyrrolidin-1-yl}-4-methyl-pentanoic acid::CHEMBL170892
SMILES CCn1nc(Cc2ccccc2)cc1C1CCN(C[C@H]2CN(C[C@@H]2c2ccccc2)[C@H](CC(C)C)C(O)=O)CC1
InChI Key InChIKey=ZTZVDDZSGANOSN-KCTCJIHVSA-N
Data  1 IC50
  Tab Delimited (TSV)   2D SDfile   Computed 3D by Vconf -m prep SDfile
Find this compound or compounds like it in BindingDB:
Activity Spreadsheet -- Enzyme Inhibition Constant Data from BindingDB
Found 1 hit for monomerid = 50141885
TargetC-C chemokine receptor type 5(Homo sapiens (Human))
Merck Research Laboratories
Curated by ChEMBL
LigandPNGBDBM50141885(2-{3-[4-(5-Benzyl-2-ethyl-2H-pyrazol-3-yl)-piperid...)
Affinity DataIC50:  2.90nM. Assay description: Inhibitory concentration of compound to displace [125I]-MIP-1 alpha from CX3C chemokine receptor 5
In DepthDetails ArticlePubMed