BDBM50141954 (R)-2-[(2S,3S)-3-{4-[2-Ethyl-5-(4-trifluoromethyl-benzyl)-2H-pyrazol-3-yl]-piperidin-1-ylmethyl}-4-(3-fluoro-phenyl)-pyrrolidin-1-yl]-3,3-dimethyl-butyric acid::CHEMBL427493
SMILES CCn1nc(Cc2ccc(cc2)C(F)(F)F)cc1C1CCN(C[C@H]2CN(C[C@@H]2c2cccc(F)c2)[C@@H](C(O)=O)C(C)(C)C)CC1
InChI Key InChIKey=TXDOSWQGMXTMBQ-LEFKNYOOSA-N
Data  1 IC50
  Tab Delimited (TSV)   2D SDfile   Computed 3D by Vconf -m prep SDfile
Find this compound or compounds like it in BindingDB:
Activity Spreadsheet -- Enzyme Inhibition Constant Data from BindingDB
Found 1 hit for monomerid = 50141954
TargetC-C chemokine receptor type 5(Homo sapiens (Human))
Merck Research Laboratories
Curated by ChEMBL
LigandPNGBDBM50141954((R)-2-[(2S,3S)-3-{4-[2-Ethyl-5-(4-trifluoromethyl-...)
Affinity DataIC50:  0.300nM. Assay description: Inhibitory concentration for displacement of [125I]-MIP-1 alpha from recombinant human CC chemokine receptor 5 (CCR5) expressed in CHO cell
In DepthDetails ArticlePubMed