BDBM50141995 (2R,4S)-2-[(2S,3S)-3-[4-(2-Ethyl-5-naphthalen-1-ylmethyl-2H-pyrazol-3-yl)-piperidin-1-ylmethyl]-4-(3-fluoro-phenyl)-pyrrolidin-1-yl]-3-methyl-pentanoic acid::CHEMBL366611
SMILES CC[C@H](C)[C@@H](N1C[C@H](CN2CCC(CC2)c2cc(Cc3cccc4ccccc34)nn2CC)[C@H](C1)c1cccc(F)c1)C(O)=O
InChI Key InChIKey=JMOOJQQUXGNGBN-VZIQHIPPSA-N
Data  1 IC50
  Tab Delimited (TSV)   2D SDfile   Computed 3D by Vconf -m prep SDfile
Find this compound or compounds like it in BindingDB:
Activity Spreadsheet -- Enzyme Inhibition Constant Data from BindingDB
Found 1 hit for monomerid = 50141995
TargetC-C chemokine receptor type 5(Homo sapiens (Human))
Merck Research Laboratories
Curated by ChEMBL
LigandPNGBDBM50141995((2R,4S)-2-[(2S,3S)-3-[4-(2-Ethyl-5-naphthalen-1-yl...)
Affinity DataIC50:  0.400nM. Assay description: Inhibitory concentration for displacement of [125I]-MIP-1 alpha from recombinant human CC chemokine receptor 5 (CCR5) expressed in CHO cell
In DepthDetails ArticlePubMed