BDBM50142028 CHEMBL3758700
SMILES CC1(C)OCc2c1nc(nc2Nc1n[nH]c2c(Cl)c(F)ccc12)-c1cn[nH]c1
InChI Key InChIKey=XXKKLMVAVKRRTQ-UHFFFAOYSA-N
Data  1 KI
  Tab Delimited (TSV)   2D SDfile   Computed 3D by Vconf -m prep SDfile
Find this compound or compounds like it in BindingDB:
Activity Spreadsheet -- Enzyme Inhibition Constant Data from BindingDB
Found 1 hit for monomerid = 50142028
TargetEpidermal growth factor receptor(Homo sapiens (Human))
Genentech
Curated by ChEMBL
LigandPNGBDBM50142028(CHEMBL3758700)
Affinity DataKi:  4nM. Assay description: Inhibition of EGFR T790M/L858R mutant (unknown origin)
In DepthDetails ArticlePubMed